{"text_format":"1","workbook":"xlsx","n_sheets":15,"sheets":["利用目的選択","貸切項目入力","貸切印刷 ","貸切依頼内容","送迎項目入力","送迎印刷","送迎依頼内容 ","車種","貸切料金","貸切料金2","貸切料金計算 ","送迎料金計算","送迎料金","送迎料金2","各種"],"not_rendered":{"charts":0,"images":3,"macros":1,"external_links":0,"defined_names":55,"comments":0,"pivot_tables":0},"unopened":[],"bounds":{"document_bytes":16777216,"sheet_cells":100000,"rows_first":2000,"rows_last":500,"rows_between":2000,"halvings":0,"cell_chars":16384,"cell_head_chars":4096},"cells_cut":0,"cells_raw":0,"read":"whole","date_system":"1900"}

{"sheet":"利用目的選択","index":0,"n_rows":23,"n_cols":13,"rows_kept":23,"cut":false,"hidden":false,"merged":[[0,0,0,3],[20,9,20,11],[20,1,20,7]]}
["利用目的選択"]
[]
[]
[null,null,null,null,null,null,null,null,null,null,null,null,{"$f":"IF(貸切依頼内容!C38=各種!O5,\"貸切依頼作成済み\",\"\")","v":""}]
[]
[]
[null,null,null,null,null,null,null,null,null,null,null,null,{"$f":"IF('送迎依頼内容 '!C37=各種!O5,\"送迎依頼作成済み\",\"\")","v":""}]
[]
[]
[]
{"$rows_left_out":14}
{"sheet":"貸切項目入力","index":1,"n_rows":64,"n_cols":14,"rows_kept":64,"cut":false,"hidden":false,"merged":[[20,1,20,4],[27,7,28,12],[37,1,39,1],[34,11,34,12],[32,5,32,6],[37,5,37,6],[27,3,27,4],[38,5,38,6],[30,5,30,12],[22,1,25,2],[27,1,30,2],[28,3,28,4],[29,3,29,4],[30,3,30,4],[22,3,22,4],[23,3,23,4],[24,3,24,4],[25,3,25,4],[22,5,22,6],[23,5,23,6],[27,5,27,6],[24,5,24,12],[25,5,25,12],[44,1,44,4],[29,5,29,12],[42,5,42,6],[43,5,43,6],[44,5,44,6],[42,7,42,8],[43,7,43,8],[44,7,44,8],[42,1,42,4],[43,1,43,4],[60,5,60,10],[61,5,61,10],[63,5,63,10],[42,10,42,11],[43,10,43,11],[44,10,44,11],[59,1,59,10],[51,1,57,2],[57,3,57,4],[51,5,51,6],[52,5,52,6],[53,5,53,6],[54,5,54,6],[55,5,55,7],[56,5,56,7],[57,5,57,7],[0,0,0,3],[16,5,16,6],[17,5,17,6],[16,3,16,4],[17,3,17,4],[16,1,18,2],[18,3,18,4],[28,5,28,6],[39,5,39,6],[32,1,32,4],[37,2,37,4],[38,2,38,4],[39,2,39,4],[61,1,61,4],[63,1,63,4],[51,3,51,4],[52,3,52,4],[53,3,53,4],[54,3,54,4],[55,3,55,4],[60,1,60,4],[56,3,56,4]]}
["貸切項目入力",null,null,null,null,"利用目的","観光/時間貸切"]
[]
[]
[]
[]
[]
[]
[]
[]
[]
{"$rows_left_out":55}
{"sheet":"貸切印刷 ","index":2,"n_rows":33,"n_cols":12,"rows_kept":33,"cut":false,"hidden":false,"merged":[[0,1,0,4],[3,1,4,7],[23,2,23,3],[26,6,26,7],[14,1,14,5],[32,1,32,7],[18,2,18,3],[19,2,19,3],[19,5,19,7],[20,2,20,3],[20,5,20,7],[18,5,18,7],[21,2,21,7]]}
[null,"シミュレーション結果印刷"]
[]
[null,null,null,null,null,null,"発行日",{"$f":"TODAY()","v":"2025-08-27"}]
[null,"シミュレーション結果",null,null,null,null,null,null,null,null,null,"←マクロ対応ボタンです。"]
[null,null,null,null,null,null,null,null,null,null,null,"　マクロが有効でない場合は、"]
[null,null,null,null,null,null,null,null,null,null,null,"　通常の印刷操作からも印刷可能です。"]
[null,{"$f":"貸切項目入力!F53&貸切項目入力!H53","v":""}]
[null,{"$f":"貸切項目入力!F54&貸切項目入力!H54","v":""}]
[null,{"$f":"貸切項目入力!F55&貸切項目入力!H55","v":"様"}]
[null,{"$f":"\"TEL:\"&貸切項目入力!F56&\"  FAX:\"&貸切項目入力!F57","v":"TEL:  FAX:"},null,null,null,"シミュレーション問合せ先"]
{"$rows_left_out":24}
{"sheet":"貸切依頼内容","index":3,"n_rows":47,"n_cols":9,"rows_kept":47,"cut":false,"hidden":false,"merged":[[14,5,14,6],[6,2,6,4],[7,2,7,4],[21,2,21,4],[22,2,22,4],[8,2,8,4],[9,2,9,4],[10,2,10,4],[11,2,11,4],[12,2,12,4],[13,2,13,4],[18,2,18,4],[16,2,16,4],[17,2,17,4],[23,2,23,4],[41,7,41,9],[42,7,42,9],[43,7,43,9],[34,1,36,1],[36,2,36,4],[28,2,28,4],[33,5,33,10],[32,5,32,14],[0,1,0,2],[19,2,19,4],[5,1,5,4],[38,2,38,4],[33,2,33,4],[37,2,37,4],[25,2,25,4],[26,2,26,4],[29,2,29,4],[30,2,30,4],[31,2,31,4],[32,2,32,4],[35,2,35,4],[34,2,34,4],[24,2,24,4],[27,2,27,4]]}
[null,"ハイヤー貸切依頼"]
[]
[]
[null,"下記の空欄に必要事項を選択/記載して下さい。"]
[]
[null,{"$f":"B1&\"書\"","v":"ハイヤー貸切依頼書"}]
[null,"会社名or名前\n（会社名優先）",{"$f":"IF(貸切項目入力!F53=\"\",貸切項目入力!F55,貸切項目入力!F53)","v":0}]
[null,"部署",{"$f":"IF(貸切項目入力!F54=\"\",\"\",貸切項目入力!F54)","v":""}]
[null,"名前",{"$f":"IF(貸切項目入力!F55=\"\",各種!Q3,貸切項目入力!F55)","v":"「項目入力」ページのシュミレーション結果記載事項に入力してください"}]
[null,"TEL",{"$f":"IF(貸切項目入力!F56=\"\",各種!Q3,貸切項目入力!F56)","v":"「項目入力」ページのシュミレーション結果記載事項に入力してください"}]
{"$rows_left_out":38}
{"sheet":"送迎項目入力","index":4,"n_rows":61,"n_cols":14,"rows_kept":61,"cut":false,"hidden":false,"merged":[[20,1,20,4],[27,7,28,12],[32,5,32,6],[54,3,54,4],[0,0,0,3],[16,1,18,2],[22,1,25,2],[27,1,30,2],[27,5,27,6],[28,5,28,6],[29,5,29,12],[30,5,30,12],[22,5,22,6],[23,5,23,6],[24,5,24,12],[25,5,25,12],[34,5,34,6],[35,5,35,6],[36,5,36,6],[34,2,34,4],[35,2,35,4],[36,2,36,4],[39,5,39,6],[40,5,40,6],[41,5,41,6],[39,1,39,4],[40,1,40,4],[41,1,41,4],[39,7,39,8],[40,7,40,8],[41,7,41,8],[39,10,39,11],[40,10,40,11],[41,10,41,11],[57,1,57,4],[58,1,58,4],[57,5,57,10],[58,5,58,10],[60,1,60,4],[60,5,60,10],[56,1,56,10],[48,3,48,4],[49,3,49,4],[50,3,50,4],[51,3,51,4],[52,3,52,4],[53,3,53,4],[53,5,53,6],[54,5,54,6],[48,5,48,6],[49,5,49,6],[50,5,50,6],[51,5,51,6],[52,5,52,6],[16,5,16,6],[17,5,17,6],[16,3,16,4],[17,3,17,4],[18,3,18,4],[22,3,22,4],[23,3,23,4],[24,3,24,4],[25,3,25,4],[27,3,27,4],[28,3,28,4],[29,3,29,4],[30,3,30,4],[32,1,32,4],[48,1,54,2],[34,1,36,1]]}
["送迎項目入力",null,null,null,null,"利用目的","送迎"]
[]
[]
[]
[]
[]
[]
[]
[]
[]
{"$rows_left_out":52}
{"sheet":"送迎印刷","index":5,"n_rows":33,"n_cols":12,"rows_kept":33,"cut":false,"hidden":false,"merged":[[0,1,0,4],[3,1,4,7],[32,1,32,7],[18,2,18,3],[18,5,18,7],[26,6,26,7],[19,2,19,3],[20,2,20,3],[23,2,23,3],[19,5,19,7],[20,5,20,7],[21,2,21,7],[31,1,31,7],[14,1,14,5]]}
[null,"シミュレーション結果印刷"]
[]
[null,null,null,null,null,null,"発行日",{"$f":"TODAY()","v":"2025-08-27"}]
[null,"シミュレーション結果",null,null,null,null,null,null,null,null,null,"←マクロ対応ボタンです。"]
[null,null,null,null,null,null,null,null,null,null,null,"　マクロが有効でない場合は、"]
[null,null,null,null,null,null,null,null,null,null,null,"　通常の印刷操作からも印刷可能です。"]
[null,{"$f":"送迎項目入力!F50&送迎項目入力!H50","v":""}]
[null,{"$f":"送迎項目入力!F51&送迎項目入力!H51","v":""}]
[null,{"$f":"送迎項目入力!F52&送迎項目入力!H52","v":"様"}]
[null,{"$f":"\"TEL:\"&送迎項目入力!F53&\"  FAX:\"&送迎項目入力!F54","v":"TEL:  FAX:"},null,null,null,"お見積もり問合せ先"]
{"$rows_left_out":24}
{"sheet":"送迎依頼内容 ","index":6,"n_rows":46,"n_cols":9,"rows_kept":46,"cut":false,"hidden":false,"merged":[[14,5,14,6],[23,2,23,4],[24,2,24,4],[26,2,26,4],[27,2,27,4],[16,2,16,4],[42,7,42,9],[0,1,0,2],[40,7,40,9],[41,7,41,9],[31,5,31,14],[9,2,9,4],[10,2,10,4],[11,2,11,4],[18,2,18,4],[30,2,30,4],[31,2,31,4],[13,2,13,4],[17,2,17,4],[5,1,5,4],[37,2,37,4],[19,2,19,4],[36,2,36,4],[21,2,21,4],[22,2,22,4],[25,2,25,4],[28,2,28,4],[29,2,29,4],[33,1,35,1],[6,2,6,4],[7,2,7,4],[8,2,8,4],[12,2,12,4],[33,2,33,4],[34,2,34,4],[35,2,35,4],[32,2,32,4]]}
[null,"ハイヤー送迎依頼"]
[]
[]
[null,"下記の空欄に必要事項を選択/記載して下さい。"]
[]
[null,{"$f":"B1&\"書\"","v":"ハイヤー送迎依頼書"}]
[null,"会社名or名前\n（会社名優先）",{"$f":"IF(送迎項目入力!F50=\"\",送迎項目入力!F52,送迎項目入力!F50)","v":0}]
[null,"部署",{"$f":"IF(送迎項目入力!F51=\"\",\"\",送迎項目入力!F51)","v":""}]
[null,"依頼者名",{"$f":"IF(送迎項目入力!F52=\"\",各種!Q3,送迎項目入力!F52)","v":"「項目入力」ページのシュミレーション結果記載事項に入力してください"}]
[null,"TEL",{"$f":"IF(送迎項目入力!F53=\"\",各種!Q3,送迎項目入力!F53)","v":"「項目入力」ページのシュミレーション結果記載事項に入力してください"}]
{"$rows_left_out":37}
{"sheet":"車種","index":7,"n_rows":58,"n_cols":10,"rows_kept":58,"cut":false,"hidden":true,"merged":[]}
[]
["車種一覧"]
["車種",null,null,null,"1時間料金","30分料金","乗車定員"]
["スタンダード",{"$f":"COUNTIF(A$4:A4,A4)","v":1},{"$f":"A4&B4","v":"スタンダード1"},"普通車タクシー",9030,3010,4,null,"料金などの変更","①カラー枠を修正"]
["スタンダード",{"$f":"COUNTIF(A$4:A5,A5)","v":2},{"$f":"A5&B5","v":"スタンダード2"},"ミニバンタクシー",13040,3010,6]
[null,{"$f":"COUNTIF(A$4:A6,A6)","v":0},"0",null,null,null,null,null,"車種を増やす","①行の挿入"]
["ハイグレードセダン",{"$f":"COUNTIF(A$4:A7,A7)","v":1},"ハイグレードセダン1","ベンツEQS",17050,3010,4,null,null,"②カラーセルに項目追加"]
["ハイグレードセダン",{"$f":"COUNTIF(A$4:A8,A8)","v":2},"ハイグレードセダン2","ベンツEQE",17050,3010,4,null,null,"③BC列はうえのセルからダウンコピー"]
["ハイグレードセダン",{"$f":"COUNTIF(A$4:A9,A9)","v":3},"ハイグレードセダン3","BMW ix",17050,3010,4]
["ハイグレードセダン",{"$f":"COUNTIF(A$4:A10,A10)","v":4},"ハイグレードセダン4","BMW i7(TAXI)",20050,3010,4]
{"$rows_left_out":49}
{"sheet":"貸切料金","index":8,"n_rows":98,"n_cols":8,"rows_kept":98,"cut":false,"hidden":true,"merged":[]}
[]
[null,null,"迎車設定で選択されたエリア",{"$f":"貸切項目入力!F24&送迎項目入力!F25","v":"選択してください選択してください★"}]
[null,null,"返車設定で選択されたエリア",{"$f":"貸切項目入力!F29&送迎項目入力!F30","v":"選択してください選択してください★"}]
[null,null,null,null,null,"規定"]
["北海道",{"$f":"COUNTIF(A$2:A5,A5)","v":1},{"$f":"A5&B5","v":"北海道1"},"料金設定なし",{"$f":"D5&G5","v":"料金設定なし"},"-"]
["青森県",{"$f":"COUNTIF(A$2:A6,A6)","v":1},"青森県1","料金設定なし",{"$f":"D6&G6","v":"料金設定なし"},"-"]
["岩手県",{"$f":"COUNTIF(A$2:A7,A7)","v":1},"岩手県1","料金設定なし","料金設定なし","-"]
["宮城県",{"$f":"COUNTIF(A$2:A8,A8)","v":1},"宮城県1","料金設定なし","料金設定なし","-"]
["秋田県",{"$f":"COUNTIF(A$2:A9,A9)","v":1},"秋田県1","料金設定なし","料金設定なし","-"]
["山形県",{"$f":"COUNTIF(A$2:A10,A10)","v":1},"山形県1","料金設定なし","料金設定なし","-"]
{"$rows_left_out":89}
{"sheet":"貸切料金2","index":9,"n_rows":52,"n_cols":14,"rows_kept":52,"cut":false,"hidden":true,"merged":[]}
[]
[null,null,null,null,null,{"$f":"貸切項目入力!F25","v":"選択してください★"},null,null,null,null,null,null,{"$f":"貸切項目入力!F30","v":"選択してください★"}]
[]
[null,null,null,null,null,"選択してください★",null,null,null,null,null,null,"選択してください★"]
[null,"北海道",{"$f":"貸切項目入力!F24","v":"選択してください"},1,{"$f":"C5&D5","v":"選択してください1"},{"$f":"IFERROR(VLOOKUP(E5,貸切料金!C:E,3,FALSE),\"\")","v":""},{"$f":"VLOOKUP(E5,貸切料金!C37:F153,4,FALSE)","v":{"$error":"#N/A"}},null,null,{"$f":"貸切項目入力!F29","v":"選択してください"},1,{"$f":"J5&K5","v":"選択してください1"},{"$f":"IFERROR(VLOOKUP(L5,貸切料金!C:E,3,FALSE),\"\")","v":""},{"$f":"VLOOKUP(L5,貸切料金!C37:F153,4,FALSE)","v":{"$error":"#N/A"}}]
[null,"青森県",{"$f":"貸切項目入力!F24","v":"選択してください"},2,{"$f":"C6&D6","v":"選択してください2"},{"$f":"IFERROR(VLOOKUP(E6,貸切料金!C:E,3,FALSE),\"\")","v":""},{"$f":"VLOOKUP(E6,貸切料金!C38:F154,4,FALSE)","v":{"$error":"#N/A"}},null,null,{"$f":"貸切項目入力!F29","v":"選択してください"},2,{"$f":"J6&K6","v":"選択してください2"},{"$f":"IFERROR(VLOOKUP(L6,貸切料金!C:E,3,FALSE),\"\")","v":""},{"$f":"VLOOKUP(L6,貸切料金!C38:F154,4,FALSE)","v":{"$error":"#N/A"}}]
[null,"岩手県",{"$f":"貸切項目入力!F24","v":"選択してください"},3,"選択してください3",{"$f":"IFERROR(VLOOKUP(E7,貸切料金!C:E,3,FALSE),\"\")","v":""},{"$f":"VLOOKUP(E7,貸切料金!C38:F155,4,FALSE)","v":{"$error":"#N/A"}},null,null,{"$f":"貸切項目入力!F29","v":"選択してください"},3,"選択してください3",{"$f":"IFERROR(VLOOKUP(L7,貸切料金!C:E,3,FALSE),\"\")","v":""},{"$f":"VLOOKUP(L7,貸切料金!C38:F155,4,FALSE)","v":{"$error":"#N/A"}}]
[null,"宮城県",{"$f":"貸切項目入力!F24","v":"選択してください"},4,"選択してください4",{"$f":"IFERROR(VLOOKUP(E8,貸切料金!C:E,3,FALSE),\"\")","v":""},{"$f":"VLOOKUP(E8,貸切料金!C39:F156,4,FALSE)","v":{"$error":"#N/A"}},null,null,{"$f":"貸切項目入力!F29","v":"選択してください"},4,"選択してください4",{"$f":"IFERROR(VLOOKUP(L8,貸切料金!C:E,3,FALSE),\"\")","v":""},{"$f":"VLOOKUP(L8,貸切料金!C39:F156,4,FALSE)","v":{"$error":"#N/A"}}]
[null,"秋田県",{"$f":"貸切項目入力!F24","v":"選択してください"},5,"選択してください5",{"$f":"IFERROR(VLOOKUP(E9,貸切料金!C:E,3,FALSE),\"\")","v":""},{"$f":"VLOOKUP(E9,貸切料金!C40:F157,4,FALSE)","v":{"$error":"#N/A"}},null,null,{"$f":"貸切項目入力!F29","v":"選択してください"},5,"選択してください5",{"$f":"IFERROR(VLOOKUP(L9,貸切料金!C:E,3,FALSE),\"\")","v":""},{"$f":"VLOOKUP(L9,貸切料金!C40:F157,4,FALSE)","v":{"$error":"#N/A"}}]
[null,"山形県",{"$f":"貸切項目入力!F24","v":"選択してください"},6,"選択してください6",{"$f":"IFERROR(VLOOKUP(E10,貸切料金!C:E,3,FALSE),\"\")","v":""},{"$f":"VLOOKUP(E10,貸切料金!C41:F158,4,FALSE)","v":{"$error":"#N/A"}},null,null,{"$f":"貸切項目入力!F29","v":"選択してください"},6,"選択してください6",{"$f":"IFERROR(VLOOKUP(L10,貸切料金!C:E,3,FALSE),\"\")","v":""},{"$f":"VLOOKUP(L10,貸切料金!C41:F158,4,FALSE)","v":{"$error":"#N/A"}}]
{"$rows_left_out":43}
{"sheet":"貸切料金計算 ","index":10,"n_rows":58,"n_cols":21,"rows_kept":58,"cut":false,"hidden":true,"merged":[[5,1,6,1],[1,1,2,1]]}
[]
[null,"送迎",null,"利用時間",null,null,"区域外規定迎え","区域外規定送り","元規定","30分分",null,null,"１時間料金","30分料金","料金",null,"英会話","30分料金","レベル","合計","延長"]
[null,null,null,{"$f":"貸切項目入力!F33","v":"00:00:00"},{"$f":"LOOKUP(D3,D10:E58)*2","v":0},null,{"$f":"VLOOKUP(貸切料金2!F2,貸切料金2!F5:G18,2,FALSE)","v":{"$error":"#N/A"}},{"$f":"VLOOKUP(貸切料金2!M2,貸切料金2!M5:N19,2,FALSE)","v":{"$error":"#N/A"}},2,{"$f":"E3-I3","v":-2},{"$f":"G3*2","v":{"$error":"#N/A"}},{"$f":"H3*2","v":{"$error":"#N/A"}},{"$f":"VLOOKUP(貸切項目入力!F18,車種!D:F,2,FALSE)","v":{"$error":"#N/A"}},{"$f":"VLOOKUP(貸切項目入力!F18,車種!D:F,3,FALSE)","v":{"$error":"#N/A"}},{"$f":"M3+((J4+K3+L3)*N3)","v":{"$error":"#N/A"}},null,null,null,null,{"$f":"E3*Q4*R4*S4","v":0}]
[null,"エグゼクティブ",null,{"$f":"IF(貸切項目入力!F17=車種!A23,貸切料金2!E26,貸切項目入力!F33)","v":"00:00:00"},{"$f":"VLOOKUP(D4,D10:F58,3,FALSE)","v":0},null,null,null,2,{"$f":"E4-I4","v":-2},null,null,null,null,null,null,{"$f":"IF(貸切項目入力!F38=各種!D4,1,0)","v":0},1000,{"$f":"IF(OR(貸切項目入力!F40=各種!F4,貸切項目入力!F40=各種!F5),1,0)","v":0},{"$f":"E4*Q4*R4*S4","v":0},{"$f":"Q4*R4*S4","v":0}]
[]
[null,null,null,"01:30:00",{"$f":"VLOOKUP(D6,D10:E58,2,FALSE)","v":1.5},{"$f":"VLOOKUP(D6,D10:F58,3,FALSE)","v":3}]
[null,null,null,{"$f":"VLOOKUP(貸切項目入力!F23,'貸切料金計算 '!D10:E58,2,FALSE)","v":0},{"$f":"VLOOKUP(貸切項目入力!F28,'貸切料金計算 '!D10:E58,2,FALSE)","v":0},{"$f":"E7-D7","v":0}]
[]
[]
[null,null,0,"00:00:00",0,{"$f":"E10*2","v":0}]
{"$rows_left_out":49}
{"sheet":"送迎料金計算","index":11,"n_rows":77,"n_cols":20,"rows_kept":77,"cut":false,"hidden":true,"merged":[[2,1,3,1],[6,1,7,1]]}
[]
[]
[null,"お迎え","区域外規定迎え","料金","利用可能時間",null,null,"区域外規定迎え","料金","利用可能時間",null,"１時間料金","30分料金","料金",null,"英会話","30分料金","レベル","合計","延長"]
[null,null,{"$f":"VLOOKUP(送迎料金2!F2,送迎料金2!F5:G14,2,FALSE)","v":{"$error":"#N/A"}},{"$f":"VLOOKUP(送迎料金2!F2,送迎料金2!F5:H14,3,FALSE)","v":{"$error":"#N/A"}},{"$f":"VLOOKUP(送迎料金2!F2,送迎料金2!F5:I14,4,FALSE)","v":{"$error":"#N/A"}},null,2,{"$f":"C$4*G4","v":{"$error":"#N/A"}},{"$f":"D$5*G4","v":{"$error":"#N/A"}},{"$f":"E$4*G4","v":{"$error":"#N/A"}},null,{"$f":"VLOOKUP(送迎項目入力!F18,車種!D:F,2,FALSE)","v":{"$error":"#N/A"}},{"$f":"VLOOKUP(送迎項目入力!F18,車種!D:F,3,FALSE)","v":{"$error":"#N/A"}},{"$f":"L4+(I4-G4)*M4","v":{"$error":"#N/A"}},null,{"$f":"IF(送迎項目入力!F35=各種!D4,1,0)","v":0},1000,{"$f":"IF(OR(送迎項目入力!F37=各種!F4,送迎項目入力!F37=各種!F5),1,0)","v":0},{"$f":"Q4*J4*P4*R4","v":{"$error":"#N/A"}},{"$f":"P4*Q4*R4","v":0}]
[null,"エグゼ",null,{"$f":"IF(送迎項目入力!F17=車種!A23,IF(送迎料金計算!D4<=3,3,送迎料金計算!D4),D4)","v":{"$error":"#N/A"}}]
[]
[null,"送り","区域外規定送り","料金","利用可能時間",null,null,null,null,null,null,"１時間料金","30分料金","料金",null,"英会話","30分料金","レベル","合計","延長"]
[null,null,{"$f":"VLOOKUP(送迎料金2!N2,送迎料金2!N5:O14,2,FALSE)","v":{"$error":"#N/A"}},{"$f":"VLOOKUP(送迎料金2!N2,送迎料金2!N5:P14,3,FALSE)","v":{"$error":"#N/A"}},{"$f":"VLOOKUP(送迎料金2!N2,送迎料金2!N5:Q14,4,FALSE)","v":{"$error":"#N/A"}},null,2,{"$f":"C$8*G8","v":{"$error":"#N/A"}},{"$f":"D$9*G8","v":{"$error":"#N/A"}},{"$f":"E$8*G8","v":{"$error":"#N/A"}},null,{"$f":"VLOOKUP(送迎項目入力!F18,車種!D:F,2,FALSE)","v":{"$error":"#N/A"}},{"$f":"VLOOKUP(送迎項目入力!F18,車種!D:F,3,FALSE)","v":{"$error":"#N/A"}},{"$f":"L8+(I8-G8)*M8","v":{"$error":"#N/A"}},null,{"$f":"IF(送迎項目入力!F35=各種!D4,1,0)","v":0},1000,{"$f":"IF(OR(送迎項目入力!F37=各種!F4,送迎項目入力!F37=各種!F5),1,0)","v":0},{"$f":"Q8*J8*P8*R8","v":{"$error":"#N/A"}},{"$f":"P8*Q8*R8","v":0}]
[null,"エグゼ",null,{"$f":"IF(送迎項目入力!F17=車種!A23,IF(送迎料金計算!D8<=3,3,送迎料金計算!D8),D8)","v":{"$error":"#N/A"}}]
[]
{"$rows_left_out":68}
{"sheet":"送迎料金","index":12,"n_rows":103,"n_cols":9,"rows_kept":103,"cut":false,"hidden":true,"merged":[]}
[null,null,null,null,null,"規定","料金","利用可能時間"]
["北海道",{"$f":"COUNTIF(A$2:A2,A2)","v":1},{"$f":"A2&B2","v":"北海道1"},"全土",{"$f":"D2&I2","v":"全土"},12,59,{"$f":"G2-F2","v":47}]
["青森県",{"$f":"COUNTIF(A$2:A3,A3)","v":1},{"$f":"A3&B3","v":"青森県1"},"全土",{"$f":"D3&I3","v":"全土"},12,49,37]
["岩手県",{"$f":"COUNTIF(A$2:A4,A4)","v":1},"岩手県1","全土","全土",12,43,31]
["宮城県",{"$f":"COUNTIF(A$2:A5,A5)","v":1},"宮城県1","全土","全土",12,39,27]
["秋田県",{"$f":"COUNTIF(A$2:A6,A6)","v":1},"秋田県1","全土","全土",12,43,31]
["山形県",{"$f":"COUNTIF(A$2:A7,A7)","v":1},"山形県1","全土","全土",12,35,23]
["福島県",{"$f":"COUNTIF(A$2:A8,A8)","v":1},"福島県1","全土","全土",10,35,{"$f":"G8-F8","v":25}]
["茨城県",{"$f":"COUNTIF(A$2:A9,A9)","v":1},"茨城県1","全土","全土",10,27,17]
["栃木県",{"$f":"COUNTIF(A$2:A10,A10)","v":1},"栃木県1","全土","全土",10,27,17]
{"$rows_left_out":94}
{"sheet":"送迎料金2","index":13,"n_rows":52,"n_cols":17,"rows_kept":52,"cut":false,"hidden":true,"merged":[]}
[]
[null,null,null,null,null,{"$f":"送迎項目入力!F25","v":"選択してください★"},null,null,null,null,null,null,null,{"$f":"送迎項目入力!F30","v":"選択してください★"}]
[]
[null,null,null,null,null,"選択してください★",null,null,null,null,null,null,null,"選択してください★"]
[null,"北海道",{"$f":"送迎項目入力!F$24","v":"選択してください"},1,{"$f":"C5&D5","v":"選択してください1"},{"$f":"VLOOKUP(E5,送迎料金!C:E,3,FALSE)","v":{"$error":"#N/A"}},{"$f":"VLOOKUP(E5,送迎料金!C:F,4,FALSE)","v":{"$error":"#N/A"}},{"$f":"VLOOKUP(E5,送迎料金!C:G,5,FALSE)","v":{"$error":"#N/A"}},{"$f":"VLOOKUP(E5,送迎料金!C:H,6,FALSE)","v":{"$error":"#N/A"}},null,{"$f":"送迎項目入力!F29","v":"選択してください"},1,{"$f":"K5&L5","v":"選択してください1"},{"$f":"VLOOKUP(M5,送迎料金!C:E,3,FALSE)","v":{"$error":"#N/A"}},{"$f":"VLOOKUP(M5,送迎料金!C:F,4,FALSE)","v":{"$error":"#N/A"}},{"$f":"VLOOKUP(M5,送迎料金!C:G,5,FALSE)","v":{"$error":"#N/A"}},{"$f":"VLOOKUP(M5,送迎料金!C:H,6,FALSE)","v":{"$error":"#N/A"}}]
[null,"青森県",{"$f":"送迎項目入力!F$24","v":"選択してください"},2,{"$f":"C6&D6","v":"選択してください2"},{"$f":"VLOOKUP(E6,送迎料金!C:E,3,FALSE)","v":{"$error":"#N/A"}},{"$f":"VLOOKUP(E6,送迎料金!C:F,4,FALSE)","v":{"$error":"#N/A"}},{"$f":"VLOOKUP(E6,送迎料金!C:G,5,FALSE)","v":{"$error":"#N/A"}},{"$f":"VLOOKUP(E6,送迎料金!C:H,6,FALSE)","v":{"$error":"#N/A"}},null,{"$f":"送迎項目入力!F29","v":"選択してください"},2,{"$f":"K6&L6","v":"選択してください2"},{"$f":"VLOOKUP(M6,送迎料金!C:E,3,FALSE)","v":{"$error":"#N/A"}},{"$f":"VLOOKUP(M6,送迎料金!C:F,4,FALSE)","v":{"$error":"#N/A"}},{"$f":"VLOOKUP(M6,送迎料金!C:G,5,FALSE)","v":{"$error":"#N/A"}},{"$f":"VLOOKUP(M6,送迎料金!C:H,6,FALSE)","v":{"$error":"#N/A"}}]
[null,"岩手県",{"$f":"送迎項目入力!F$24","v":"選択してください"},3,"選択してください3",{"$f":"VLOOKUP(E7,送迎料金!C:E,3,FALSE)","v":{"$error":"#N/A"}},{"$f":"VLOOKUP(E7,送迎料金!C:F,4,FALSE)","v":{"$error":"#N/A"}},{"$f":"VLOOKUP(E7,送迎料金!C:G,5,FALSE)","v":{"$error":"#N/A"}},{"$f":"VLOOKUP(E7,送迎料金!C:H,6,FALSE)","v":{"$error":"#N/A"}},null,{"$f":"送迎項目入力!F29","v":"選択してください"},3,"選択してください3",{"$f":"VLOOKUP(M7,送迎料金!C:E,3,FALSE)","v":{"$error":"#N/A"}},{"$f":"VLOOKUP(M7,送迎料金!C:F,4,FALSE)","v":{"$error":"#N/A"}},{"$f":"VLOOKUP(M7,送迎料金!C:G,5,FALSE)","v":{"$error":"#N/A"}},{"$f":"VLOOKUP(M7,送迎料金!C:H,6,FALSE)","v":{"$error":"#N/A"}}]
[null,"宮城県",{"$f":"送迎項目入力!F$24","v":"選択してください"},4,"選択してください4",{"$f":"VLOOKUP(E8,送迎料金!C:E,3,FALSE)","v":{"$error":"#N/A"}},{"$f":"VLOOKUP(E8,送迎料金!C:F,4,FALSE)","v":{"$error":"#N/A"}},{"$f":"VLOOKUP(E8,送迎料金!C:G,5,FALSE)","v":{"$error":"#N/A"}},{"$f":"VLOOKUP(E8,送迎料金!C:H,6,FALSE)","v":{"$error":"#N/A"}},null,{"$f":"送迎項目入力!F29","v":"選択してください"},4,"選択してください4",{"$f":"VLOOKUP(M8,送迎料金!C:E,3,FALSE)","v":{"$error":"#N/A"}},{"$f":"VLOOKUP(M8,送迎料金!C:F,4,FALSE)","v":{"$error":"#N/A"}},{"$f":"VLOOKUP(M8,送迎料金!C:G,5,FALSE)","v":{"$error":"#N/A"}},{"$f":"VLOOKUP(M8,送迎料金!C:H,6,FALSE)","v":{"$error":"#N/A"}}]
[null,"秋田県",{"$f":"送迎項目入力!F$24","v":"選択してください"},5,"選択してください5",{"$f":"VLOOKUP(E9,送迎料金!C:E,3,FALSE)","v":{"$error":"#N/A"}},{"$f":"VLOOKUP(E9,送迎料金!C:F,4,FALSE)","v":{"$error":"#N/A"}},{"$f":"VLOOKUP(E9,送迎料金!C:G,5,FALSE)","v":{"$error":"#N/A"}},{"$f":"VLOOKUP(E9,送迎料金!C:H,6,FALSE)","v":{"$error":"#N/A"}},null,{"$f":"送迎項目入力!F29","v":"選択してください"},5,"選択してください5",{"$f":"VLOOKUP(M9,送迎料金!C:E,3,FALSE)","v":{"$error":"#N/A"}},{"$f":"VLOOKUP(M9,送迎料金!C:F,4,FALSE)","v":{"$error":"#N/A"}},{"$f":"VLOOKUP(M9,送迎料金!C:G,5,FALSE)","v":{"$error":"#N/A"}},{"$f":"VLOOKUP(M9,送迎料金!C:H,6,FALSE)","v":{"$error":"#N/A"}}]
[null,"山形県",{"$f":"送迎項目入力!F$24","v":"選択してください"},6,"選択してください6",{"$f":"VLOOKUP(E10,送迎料金!C:E,3,FALSE)","v":{"$error":"#N/A"}},{"$f":"VLOOKUP(E10,送迎料金!C:F,4,FALSE)","v":{"$error":"#N/A"}},{"$f":"VLOOKUP(E10,送迎料金!C:G,5,FALSE)","v":{"$error":"#N/A"}},{"$f":"VLOOKUP(E10,送迎料金!C:H,6,FALSE)","v":{"$error":"#N/A"}},null,{"$f":"送迎項目入力!F29","v":"選択してください"},6,"選択してください6",{"$f":"VLOOKUP(M10,送迎料金!C:E,3,FALSE)","v":{"$error":"#N/A"}},{"$f":"VLOOKUP(M10,送迎料金!C:F,4,FALSE)","v":{"$error":"#N/A"}},{"$f":"VLOOKUP(M10,送迎料金!C:G,5,FALSE)","v":{"$error":"#N/A"}},{"$f":"VLOOKUP(M10,送迎料金!C:H,6,FALSE)","v":{"$error":"#N/A"}}]
{"$rows_left_out":43}
{"sheet":"各種","index":14,"n_rows":51,"n_cols":17,"rows_kept":51,"cut":false,"hidden":true,"merged":[]}
[]
[]
["送迎","00:00:00",null,"選択してください","選択してください","選択してください",null,"選択してください",null,null,"選択してください","選択してください",{"$f":"IF(貸切項目入力!F17=車種!H49,1,0)","v":0},null,null,null,"「項目入力」ページのシュミレーション結果記載事項に入力してください"]
["観光/時間貸切","00:30:00",null,"必要","英語","有料観光レベル",null,1,null,null,"一般貸切(法人以外の方のご依頼はこちらを選択してください）","現金（当日）",{"$f":"IF(貸切項目入力!F17=車種!H50,1,0)","v":0},null,"選択してください","選択してください","「項目入力」ページの入力項目へ選択/入力してください"]
[null,"01:00:00",null,"不要","中国語","無料観光レベル",null,2,null,"様","法人（企業等）","クレジットカード（当日）",{"$f":"M3+M4","v":0},null,"上記を確認し、依頼する","本依頼以外での関連依頼は無い"]
[null,"01:30:00",null,null,"韓国語","送迎レベル",null,3,null,"御中","法人（官公庁）","タクシーチケット（当日）",{"$f":"IF(M5=1,M8,M9)","v":"希望する"},null,null,"本依頼に関連する別日/別時間帯/別車両利用の依頼が別途ある"]
[null,"02:00:00",null,null,null,null,null,"未対応（４台以上）",null,null,"法人（医療）","事前カード決済（事前に決済用URLをMKよりお送ります）","必要ない"]
[null,"02:30:00",null,null,null,null,null,null,null,null,"法人（冠婚葬祭）","事前振込（事前に請求書をMKよりお送ります）","本車種は車番情報連絡には対応しておりません。"]
[null,"03:00:00",null,null,null,null,null,null,null,null,"旅行社","事後請求","希望する"]
[null,"03:30:00",null,null,null,null,null,null,null,null,"ホテル・旅館","クーポン（JTB/全旅/KNT/京旅協）"]
{"$rows_left_out":41}